[Top][All Lists]

[Date Prev][Date Next][Thread Prev][Thread Next][Date Index][Thread Index]

[bug #29511] fails to build on kfreebsd-*

From: Andreas Metzler
Subject: [bug #29511] fails to build on kfreebsd-*
Date: Sat, 10 Apr 2010 13:02:56 +0000
User-agent: Mozilla/5.0 (X11; U; Linux i686 (x86_64); en-US; rv: Gecko/2010033100 Iceweasel/3.0.6 (Debian-3.0.6-3)


                 Summary: fails to build on kfreebsd-*
                 Project: findutils
            Submitted by: ametzler
            Submitted on: Sa 10 Apr 2010 15:02:55 CEST
                Category: find
                Severity: 3 - Normal
              Item Group: Compilation Failure
                  Status: None
                 Privacy: Public
             Assigned to: None
         Originator Name: 
        Originator Email: 
             Open/Closed: Open
         Discussion Lock: Any
                 Release: 4.5.6b
           Fixed Release: None



Starting with 4.5.6b (up to and including the latest release 4.5.8) findutils
fails to build on kfreebsd-* with this error message:

gcc -std=gnu99 -DHAVE_CONFIG_H -I. -I.. -I../gnulib/lib -I../gnulib/lib  
-Wdeclaration-after-statement -Wall -g -O2 -MT fdleak.o -MD -MP -MF
.deps/fdleak.Tpo -c -o fdleak.o fdleak.c
fdleak.c: In function ‘get_max_fd’:
fdleak.c:125: error: ‘RLIM_SAVED_MAX’ undeclared (first use in this
fdleak.c:125: error: (Each undeclared identifier is reported only once
fdleak.c:125: error: for each function it appears in.)
fdleak.c:127: error: ‘RLIM_SAVED_CUR’ undeclared (first use in this
make[3]: *** [fdleak.o] Fehler 1
make[3]: Leaving directory `/tmp/FIND/findutils-4.5.6b/lib'
make[2]: *** [all] Fehler 2
make[2]: Leaving directory `/tmp/FIND/findutils-4.5.6b/lib'
make[1]: *** [all-recursive] Fehler 1
make[1]: Leaving directory `/tmp/FIND/findutils-4.5.6b'
make: *** [all] Fehler 2

See also http://bugs.debian.org/577131


Reply to this item at:


  Nachricht geschickt von/durch Savannah

reply via email to

[Prev in Thread] Current Thread [Next in Thread]