[Top][All Lists]

[Date Prev][Date Next][Thread Prev][Thread Next][Date Index][Thread Index]

bug#9431: make RUN_EXPENSIVE_TESTS=yes check FAIL

From: gio manz
Subject: bug#9431: make RUN_EXPENSIVE_TESTS=yes check FAIL
Date: Sat, 3 Sep 2011 09:59:20 +0200

Hi, I'm compiling Linux From Scrach, and when try to copmpile coreutils, on
"make RUN_EXPENSIVE_TESTS=yes check", if fail with:

1 of 211 tests failed
(19 tests were not run)
See gnulib-tests/test-suite.log
Please report to address@hidden
make[6]: *** [test-suite.log] Error 1
make[6]: Leaving directory `/lfs/sources/coreutils-8.10/gnulib-tests'
make[5]: *** [check-TESTS] Error 2
make[5]: Leaving directory `/lfs/sources/coreutils-8.10/gnulib-tests'
make[4]: *** [check-am] Error 2
make[4]: Leaving directory `/lfs/sources/coreutils-8.10/gnulib-tests'
make[3]: *** [check-recursive] Error 1
make[3]: Leaving directory `/lfs/sources/coreutils-8.10/gnulib-tests'
make[2]: *** [check] Error 2
make[2]: Leaving directory `/lfs/sources/coreutils-8.10/gnulib-tests'
make[1]: *** [check-recursive] Error 1
make[1]: Leaving directory `/lfs/sources/coreutils-8.10'
make: *** [check] Error 2

real    1m56.428s
user    1m21.180s
sys    0m49.370s

I hope this mail is helpful to you.

Attachment: test-suite.log
Description: Text Data

reply via email to

[Prev in Thread] Current Thread [Next in Thread]