[Top][All Lists]

[Date Prev][Date Next][Thread Prev][Thread Next][Date Index][Thread Index]

Making of coreutils-6.9-3 failed

From: Peter Dyballa
Subject: Making of coreutils-6.9-3 failed
Date: Mon, 16 Apr 2007 21:59:11 +0200


PASS: dot-rel
./inaccessible: /sw/src/fink.build/coreutils-6.9-3/coreutils-6.9/ tests/rm: not writable by user `nobody'
./inaccessible: skipping this test
SKIP: inaccessible
./unread3: /sw/src/fink.build/coreutils-6.9-3/coreutils-6.9/tests/rm: not writable by user `nobody'
./unread3: skipping this test
SKIP: unread3
PASS: no-give-up
PASS: dir-no-w
rm: illegal option -- -
usage: rm [-f | -i] [-dPRrvW] file ...
       unlink file
./fail-2eperm: cannot access required version (6.9) of rm
out exp differ: char 5, line 1
< rm: a/b: Operation not permitted
< rm: a: Directory not empty
> rm: cannot remove `a/b': Operation not permitted
FAIL: fail-2eperm
SKIP: isatty
1 of 19 tests failed
(17 tests were not run)
Please report to address@hidden
make[3]: *** [check-TESTS] Error 1
make[2]: *** [check-am] Error 2
make[1]: *** [check-recursive] Error 1
make: *** [check-recursive] Error 1
### execution of case failed, exit code 2

Package manager version: 0.27.1
Distribution version: 0.8.1.rsync powerpc
Mac OS X version: 10.4.9
Xcode version: 2.4.1
gcc version: 4.0.1 (Apple Computer, Inc. build 5367)
make version: 3.79.1

Mit friedvollen Grüßen


"It isn't pollution that's harming the environment. It's the impurities in our air and water that are doing it."

reply via email to

[Prev in Thread] Current Thread [Next in Thread]