[Top][All Lists]

[Date Prev][Date Next][Thread Prev][Thread Next][Date Index][Thread Index]

help me please

From: Андрей Аваков
Subject: help me please
Date: Fri, 27 Apr 2007 06:28:07 -0400

I build LFS system (Linux From Scratch) - www.linuxfromscratch.org.
On point 6.26.1. Installation of Automake, after compile
i take some tests and get next mistake:
PASS: yaccvpath.test
1 of 531 tests failed
(36 tests were not run)
Please report to address@hidden
make[2]: *** [check-TESTS] Error 1
make[2]: Leaving directory `/LFS/automake-1.9.6/tests'
make[1]: *** [check-am] Error 2
make[1]: Leaving directory `/LFS/automake-1.9.6 /tests'
make: *** [check-recursive] Error 1

Can you help me?

Sorry for my english.

Best wishes, Andrey Avakov

reply via email to

[Prev in Thread] Current Thread [Next in Thread]