[Top][All Lists]

[Date Prev][Date Next][Thread Prev][Thread Next][Date Index][Thread Index]

'make check' failures on linux 2.4.8 i686

From: Vin Shelton
Subject: 'make check' failures on linux 2.4.8 i686
Date: 15 Dec 2001 00:03:11 -0500

I downloaded automake-1.5b and configured it with --disable-nls and
built it with gcc 2.95.4.  Included here are the results of all the

'make check' on automake-1.5 passed all 322 tests.

Please let me know if any more information would be helpful.

  - vin shelton

make  check-TESTS
make[2]: Entering directory `/opt/build/automake-1.5b/tests'
PASS: acinclude.test
PASS: aclibobj.test
PASS: aclocal.test
PASS: aclocali.test
PASS: aclocali1.test
PASS: aclocalii.test
PASS: acoutnoq.test
PASS: acoutput.test
PASS: acoutput2.test
PASS: acoutqnl.test
PASS: acouttbs.test
PASS: acsilent.test
PASS: all.test
PASS: alpha.test
PASS: amassign.test
PASS: ammissing.test
PASS: ansi.test
PASS: ansi2.test
FAIL: ansi3.test
PASS: ansi4.test
FAIL: ansi5.test
PASS: asm.test
PASS: auxdir.test
XFAIL: auxdir2.test
PASS: backsl.test
PASS: backsl2.test
PASS: badline.test
PASS: badprog.test
PASS: block.test
PASS: canon.test
PASS: canon2.test
PASS: canon3.test
PASS: canon4.test
PASS: canon5.test
FAIL: ccnoco.test
PASS: check.test
PASS: checkall.test
PASS: clean.test
PASS: colneq.test
PASS: colneq2.test
PASS: colon.test
PASS: colon2.test
PASS: colon3.test
PASS: colon4.test
PASS: colon5.test
PASS: colon6.test
PASS: colon7.test
PASS: comment.test
PASS: comment2.test
PASS: comment3.test
PASS: compile_f_c_cxx.test
PASS: cond.test
PASS: cond2.test
PASS: cond3.test
FAIL: cond4.test
PASS: cond5.test
PASS: cond6.test
PASS: cond7.test
PASS: cond8.test
FAIL: cond9.test
PASS: cond10.test
PASS: cond11.test
PASS: cond12.test
PASS: cond13.test
PASS: cond14.test
PASS: cond15.test
FAIL: cond16.test
XFAIL: cond17.test
FAIL: cond18.test
FAIL: cond19.test
FAIL: cond20.test
XFAIL: condd.test
PASS: condincl.test
PASS: condincl2.test
PASS: condlib.test
PASS: condman.test
PASS: condman2.test
PASS: conf2.test
PASS: confdeps.test
PASS: confdist.test
PASS: confh.test
PASS: confh4.test
PASS: config.test
PASS: confincl.test
FAIL: confsub.test
PASS: confvar.test
PASS: confvar2.test
PASS: copy.test
PASS: ctarget1.test
PASS: cxx.test
PASS: cxxansi.test
PASS: cxxcpp.test
PASS: cxxlibobj.test
PASS: cxxlink.test
PASS: cxxnoc.test
PASS: cxxo.test
PASS: cygwin32.test
PASS: dash.test
PASS: defun.test
PASS: defun2.test
PASS: dejagnu.test
PASS: dejagnu2.test
PASS: depacl.test
PASS: depacl2.test
PASS: depcomp.test
FAIL: depcomp2.test
FAIL: depdist.test
PASS: depend.test
FAIL: depend2.test
PASS: depend3.test
PASS: depend4.test
PASS: discover.test
PASS: distcommon.test
PASS: distcommon2.test
PASS: distcommon3.test
PASS: distdir.test
FAIL: distname.test
PASS: double.test
PASS: dup2.test
PASS: dup3.test
PASS: else.test
PASS: empty.test
PASS: empty2.test
PASS: empty3.test
PASS: empty4.test
PASS: error.test
PASS: exdir.test
PASS: exdir2.test
PASS: exeext.test
PASS: exeext2.test
PASS: exsource.test
PASS: ext.test
PASS: extra.test
PASS: extra3.test
PASS: extra4.test
FAIL: extra5.test
PASS: flibs.test
PASS: fnoc.test
PASS: fo.test
PASS: fonly.test
PASS: fortdep.test
PASS: fpinst2.test
PASS: fpinstall.test
PASS: gcj.test
PASS: gcj2.test
PASS: gcj3.test
PASS: gnits.test
PASS: header.test
PASS: implicit.test
PASS: include.test
PASS: info.test
PASS: insh.test
PASS: insh2.test
FAIL: install2.test
PASS: installsh.test
PASS: instdata.test
PASS: instdata2.test
PASS: instexec.test
PASS: insthook.test
PASS: instman.test
PASS: instman2.test
PASS: interp.test
PASS: interp2.test
PASS: java.test
PASS: javaprim.test
PASS: javasubst.test
PASS: listval.test
PASS: ldadd.test
PASS: ldflags.test
PASS: lex.test
PASS: lex2.test
FAIL: lex3.test
PASS: lex4.test
PASS: libobj.test
PASS: libobj2.test
PASS: libobj3.test
PASS: libobj4.test
PASS: libobj5.test
PASS: libobj6.test
PASS: libobj7.test
PASS: libobj8.test
PASS: libobj9.test
PASS: libobj10.test
PASS: library.test
PASS: libtool.test
PASS: libtool2.test
PASS: link_c_cxx.test
PASS: link_dist.test
PASS: link_f_c.test
PASS: link_f_c_cxx.test
PASS: link_f_cxx.test
PASS: link_f_only.test
PASS: lisp.test
PASS: ltdeps.test
PASS: ltlibobjs.test
FAIL: make.test
PASS: makevars.test
PASS: man.test
PASS: mclean.test
PASS: mdate.test
PASS: mdate2.test
PASS: mdate3.test
PASS: mdate4.test
PASS: mkinst2.test
PASS: mkinstall.test
FAIL: nobase.test
PASS: nodep.test
PASS: nodepcomp.test
PASS: nodist.test
PASS: noinst.test
PASS: noinstdir.test
PASS: nolink.test
PASS: nostdinc.test
PASS: number.test
PASS: obsolete.test
PASS: order.test
PASS: outdir.test
PASS: output.test
PASS: output2.test
PASS: output3.test
PASS: output4.test
PASS: output5.test
PASS: package.test
PASS: parse.test
PASS: pluseq.test
PASS: pluseq2.test
PASS: pluseq3.test
PASS: pluseq4.test
PASS: pluseq5.test
PASS: pluseq6.test
PASS: pluseq7.test
PASS: pluseq8.test
PASS: ppf77.test
PASS: pr2.test
FAIL: pr9.test
PASS: pr72.test
FAIL: pr87.test
PASS: prefix.test
PASS: primary.test
PASS: primary2.test
PASS: proginst.test
PASS: python.test
PASS: ranlib.test
PASS: recurs.test
PASS: recurs2.test
PASS: remake.test
PASS: remake2.test
PASS: remake3.test
PASS: req.test
PASS: rulepat.test
PASS: scripts.test
PASS: seenc.test
PASS: sinclude.test
PASS: sourcesub.test
PASS: sourcesub2.test
PASS: space.test
PASS: specflags.test
PASS: specflags2.test
PASS: specflags3.test
PASS: spell.test
PASS: spell2.test
PASS: spell3.test
PASS: spelling.test
PASS: stamph.test
FAIL: stamph2.test
PASS: stdlib.test
PASS: subdir.test
PASS: subdir2.test
PASS: subdir3.test
PASS: subdir4.test
XFAIL: subdir5.test
FAIL: subdirbuiltsources.test
PASS: subobj.test
PASS: subobj2.test
FAIL: subobj3.test
PASS: subobj4.test
FAIL: subobj5.test
FAIL: subobj6.test
PASS: subobj7.test
PASS: subobj8.test
PASS: subst.test
FAIL: substref.test
PASS: substtarg.test
PASS: suffix.test
PASS: suffix2.test
PASS: suffix3.test
PASS: suffix4.test
PASS: suffix5.test
PASS: suffix6.test
PASS: suffix7.test
PASS: symlink.test
PASS: symlink2.test
PASS: symlink3.test
PASS: syntax.test
PASS: tags.test
PASS: tagsub.test
PASS: target.test
FAIL: target-cflags.test
PASS: texinfo.test
PASS: texinfo2.test
PASS: texinfo3.test
PASS: texinfo4.test
PASS: texinfo5.test
PASS: texinfo6.test
PASS: texinfo7.test
PASS: texinfo8.test
PASS: texinfo9.test
PASS: texinfo10.test
PASS: unused.test
PASS: vars.test
PASS: vartar.test
PASS: version.test
PASS: version2.test
PASS: version3.test
PASS: version4.test
PASS: vpath.test
PASS: vtexi.test
PASS: vtexi2.test
PASS: werror.test
PASS: whoami.test
PASS: xsource.test
PASS: yacc.test
PASS: yacc2.test
PASS: yacc3.test
FAIL: yacc4.test
PASS: yacc5.test
PASS: yacc6.test
FAIL: yacc7.test
PASS: yaccpp.test
FAIL: yaccvpath.test
31 of 330 tests failed
make[2]: *** [check-TESTS] Error 1
make[2]: Leaving directory `/opt/build/automake-1.5b/tests'
make[1]: *** [check-am] Error 2
make[1]: Leaving directory `/opt/build/automake-1.5b/tests'
make: *** [check-recursive] Error 1

reply via email to

[Prev in Thread] Current Thread [Next in Thread]