[Top][All Lists]

[Date Prev][Date Next][Thread Prev][Thread Next][Date Index][Thread Index]

[Axiom-mail] problems compiling axiom

From: Zoran Spasojevic
Subject: [Axiom-mail] problems compiling axiom
Date: Thu, 17 Mar 2005 00:28:36 -0500
User-agent: Mozilla Thunderbird 1.0 (X11/20041206)

I previously compiled axiom without problems but this time on Fedora Core 3 I get the error below after a few minutes of compiling. I would appreciate any suggestions that anyone may have to resolve this problem.

gcc -c -Wall -DVOL=volatile -fsigned-char -pipe -O3 -fomit-frame-pointer -I/home/zoran/axiom/lsp/gcl-2.6.5/o -I../h -I../gcl-tk sfasl.c
In file included from sfasl.c:40:
sfaslbfd.c: In function `fasload':
sfaslbfd.c:266: error: structure has no member named `_raw_size'
sfaslbfd.c:291: error: structure has no member named `_raw_size'
sfaslbfd.c:356: error: structure has no member named `_raw_size'
make[4]: *** [sfasl.o] Error 1
make[4]: Leaving directory `/home/zoran/axiom/lsp/gcl-2.6.5/o'
make[3]: *** [unixport/saved_pre_gcl] Error 2
make[3]: Leaving directory `/home/zoran/axiom/lsp/gcl-2.6.5'
/bin/sh: unixport/saved_gcl: No such file or directory
make[2]: *** [gcldir] Error 127
make[2]: Leaving directory `/home/zoran/axiom/lsp'
make[1]: *** [lspdir] Error 2
make[1]: Leaving directory `/home/zoran/axiom'
make: *** [all] Error 2

reply via email to

[Prev in Thread] Current Thread [Next in Thread]