[Top][All Lists]

[Date Prev][Date Next][Thread Prev][Thread Next][Date Index][Thread Index]

[Axiom-developer] problems compiling axiom from CVS

From: Pablo De Napoli
Subject: [Axiom-developer] problems compiling axiom from CVS
Date: Mon, 7 Mar 2005 14:23:21 -0800 (PST)


First let me say that it is great that Axiom has been released as free software.
It seems to be a great peace of software.

I've tried to build axiom from CVS, but I've got the following errors:

In file included from sfasl.c:40:
sfaslbfd.c: In function `fasload':
sfaslbfd.c:266: error: structure has no member named `_raw_size'
sfaslbfd.c:291: error: structure has no member named `_raw_size'
sfaslbfd.c:356: error: structure has no member named `_raw_size'
make[4]: *** [sfasl.o] Error 1
make[3]: *** [unixport/saved_pre_gcl] Error 2
/bin/sh: line 1: unixport/saved_gcl: No such file or directory
make[2]: *** [gcldir] Error 127
make[1]: *** [lspdir] Error 2
make: *** [all] Error 2

This messages actually occur when compiling gcl-2.6.5, not axiom itself.
I'm using Gentoo Linux (kernel 2.6.10, glibc 2.3.4)

My question is: wouldn't it be possible to use my gcl compiler from the
system instead of building another one?
(since I've succesfully built gcl-2.6.6 on my system)

best regards,
Pablo De NĂ¡poli

Celebrate Yahoo!'s 10th Birthday! 
Yahoo! Netrospective: 100 Moments of the Web

reply via email to

[Prev in Thread] Current Thread [Next in Thread]