[Top][All Lists]

[Date Prev][Date Next][Thread Prev][Thread Next][Date Index][Thread Index]

[Tlf-devel] Re: Problems during compiling.

From: Rein Couperus
Subject: [Tlf-devel] Re: Problems during compiling.
Date: Mon, 01 Mar 2004 09:47:46 +0100
User-agent: KMail/1.5.4

Hi David,

tnx for the report.... it is an oversight on my side.
It looks like 0.9.15 can only be compiled when hamlib is defined.
The function the error occors in (scanner) can only be used with hamlib :)
I will upload a corection in the next hours...

tnx and 73's

Rein PA0R

On Sunday 29 February 2004 21:21, you wrote:
> Hello Rein.
> Hope all fine.
> I got new tlf, tried to compile but got this errour:
> fi
> audio.c: In function `panscan':
> audio.c:344: error: syntax error before "outfreq"
> audio.c:403: error: `outfreq' undeclared (first use in this function)
> audio.c:403: error: (Each undeclared identifier is reported only once
> audio.c:403: error: for each function it appears in.)
> audio.c:406: error: `freq_t' undeclared (first use in this function)
> audio.c: In function `nbscan':
> audio.c:435: error: syntax error before "outfreq"
> audio.c:496: error: `outfreq' undeclared (first use in this function)
> audio.c:499: error: `freq_t' undeclared (first use in this function)
> make[2]: *** [audio.o] Error 1
> make[2]: Leaving directory `/home/ct1drb/tlf-0.9.15/src'
> make[1]: *** [all-recursive] Error 1
> make[1]: Leaving directory `/home/ct1drb/tlf-0.9.15'
> make: *** [all] Error 2
> I use SuSE 9.0 with new kernel 2.6.4-rc1, maybe it helps you.
> Best regards and till next time.
> David Quental

address@hidden or address@hidden

reply via email to

[Prev in Thread] Current Thread [Next in Thread]