[Top][All Lists]

[Date Prev][Date Next][Thread Prev][Thread Next][Date Index][Thread Index]

[Swftools-common] Re: Compilation error on latest snapshot (2009-02-02-2

From: Douglas Miller
Subject: [Swftools-common] Re: Compilation error on latest snapshot (2009-02-02-2142)
Date: Wed, 4 Feb 2009 22:04:28 -0600

I misspoke, this error was thrown using the CVS version. The tar.gz version from the downloads page built properly.


On Wed, Feb 4, 2009 at 11:33 AM, Douglas Miller <address@hidden> wrote:
I get this error when making the latest snapshot:

gcc -c -DHAVE_CONFIG_H   -I/usr/include/freetype2 -Ilame -Ilib/lame -fPIC -Wparentheses -Wimplicit -Wreturn-type -O -fomit-frame-pointer  swfcombine.c -o swfcombine.o
swfcombine.c: In function âmainâ:
swfcombine.c:1321: error: âFILEATTRIBUTE_USENETWORKâ undeclared (first use in this function)
swfcombine.c:1321: error: (Each undeclared identifier is reported only once
swfcombine.c:1321: error: for each function it appears in.)
make[1]: *** [swfcombine.o] Error 1
make[1]: Leaving directory `/root/cvs/swftools/src'
make: *** [all] Error 2

reply via email to

[Prev in Thread] Current Thread [Next in Thread]