guile-commits
[Top][All Lists]
Advanced

[Date Prev][Date Next][Thread Prev][Thread Next][Date Index][Thread Index]

[Guile-commits] Hydra job gnu:guile-2-0:build_clang on x86_64-linux, bui


From: Hydra Build Daemon
Subject: [Guile-commits] Hydra job gnu:guile-2-0:build_clang on x86_64-linux, build 3177822: Failed with non-zero exit code
Date: Wed, 10 Oct 2012 20:14:09 +0200

Hi,

This is to let you know that Hydra build 3177822 of job 
gnu:guile-2-0:build_clang has changed from 'Dependency failed' to 'Failed with 
non-zero exit code'.

Complete build information can be found on this page: 
http://hydra.nixos.org/build/3177822

The last 50 lines of the build log are shown at the bottom of this email.

A summary of the build information follows:

Build ID:              | 3177822
Nix name:              | guile-clang
Short description:     | GNU Guile 2.0, an embeddable Scheme implementation
Maintainer(s):         | address@hidden
System:                | x86_64-linux
Derivation store path: | 
/nix/store/13gibx1i0wm3gbvl123rqs5hjcz25w8r-guile-clang.drv
Output store path:     | /nix/store/q76dl0zf8lhmla5bncsjs62yqmd870n8-guile-clang
Time added:            | 2012-10-10 20:14:08
Build started:         | 2012-10-10 19:33:56
Build finished:        | 2012-10-10 20:14:08
Duration:              | 2412s

The build inputs were:

Name        | Type | Value
------------+------+--------------------------------------------------------------------------------------
hydraConfig | git  | 
git://git.savannah.gnu.org/hydra-recipes.git:2e509310e293fa058713b24f31589c2d2c4a95d4
nixpkgs     | git  | 
git://github.com/NixOS/nixpkgs.git:c35a43315c20708ce79f1e306160e8e90e4cbe75
guile       | git  | 
git://git.sv.gnu.org/guile.git:8b22ced1c9dee2743eedb5658172e931a42e8453

Regards,

The Hydra build daemon.

---
/bin/sh: warning: setlocale: LC_ALL: cannot change locale (en_US.UTF-8)
/bin/sh: warning: setlocale: LC_ALL: cannot change locale (en_US.UTF-8)
PASS: test-command-line-encoding
/tmp/nix-build-13gibx1i0wm3gbvl123rqs5hjcz25w8r-guile-clang.drv-0/build/test-suite/standalone/../../../guile-2.0.6.36-8b22c/test-suite/standalone/test-command-line-encoding2:
 line 6: warning: setlocale: LC_ALL: cannot change locale (en_US): No such file 
or directory
/bin/sh: warning: setlocale: LC_ALL: cannot change locale (en_US)
/bin/sh: warning: setlocale: LC_ALL: cannot change locale (en_US)
/bin/sh: warning: setlocale: LC_ALL: cannot change locale (en_US)
PASS: test-command-line-encoding2
PASS: test-num2integral
PASS: test-round
PASS: test-asmobs
bad return from expression `(f-sum -1 2000 -30000 40000000000)': expected 
39999971999; got 39999972255
FAIL: test-ffi
PASS: test-list
PASS: test-unwind
fail: scm_is_unsigned_integer ((- (expt 2 64) 1), 0, 18446744073709551615) == 1
FAIL: test-conversion
PASS: test-loose-ends
PASS: test-fast-slot-ref
PASS: test-mb-regexp
PASS: test-use-srfi
PASS: test-scm-c-read
PASS: test-scm-take-locale-symbol
PASS: test-scm-take-u8vector
PASS: test-scm-to-latin1-string
PASS: test-scm-values
PASS: test-extensions
PASS: test-with-guile-module
PASS: test-scm-with-guile
PASS: test-scm-spawn-thread
PASS: test-pthread-create
PASS: test-pthread-create-secondary
==================================
2 of 29 tests failed
Please report to address@hidden
==================================
make[5]: *** [check-TESTS] Error 1
make[5]: Leaving directory 
`/tmp/nix-build-13gibx1i0wm3gbvl123rqs5hjcz25w8r-guile-clang.drv-0/build/test-suite/standalone'
make[4]: *** [check-am] Error 2
make[4]: Leaving directory 
`/tmp/nix-build-13gibx1i0wm3gbvl123rqs5hjcz25w8r-guile-clang.drv-0/build/test-suite/standalone'
make[3]: *** [check] Error 2
make[3]: Leaving directory 
`/tmp/nix-build-13gibx1i0wm3gbvl123rqs5hjcz25w8r-guile-clang.drv-0/build/test-suite/standalone'
make[2]: *** [check-recursive] Error 1
make[2]: Leaving directory 
`/tmp/nix-build-13gibx1i0wm3gbvl123rqs5hjcz25w8r-guile-clang.drv-0/build/test-suite'
make[1]: *** [check-recursive] Error 1
make[1]: Leaving directory 
`/tmp/nix-build-13gibx1i0wm3gbvl123rqs5hjcz25w8r-guile-clang.drv-0/build'
make: *** [check] Error 2
build time elapsed:  0m0.028s 0m0.011s 14m20.627s 0m42.426s
builder for `/nix/store/13gibx1i0wm3gbvl123rqs5hjcz25w8r-guile-clang.drv' 
failed with exit code 2
error: build of `/nix/store/13gibx1i0wm3gbvl123rqs5hjcz25w8r-guile-clang.drv' 
failed



reply via email to

[Prev in Thread] Current Thread [Next in Thread]