[Top][All Lists]

[Date Prev][Date Next][Thread Prev][Thread Next][Date Index][Thread Index]

[Guile-commits] Hydra job gnu:guile-master:build_disable_deprecated_disa

From: Hydra Build Daemon
Subject: [Guile-commits] Hydra job gnu:guile-master:build_disable_deprecated_disable_discouraged build 353184 FAILED
Date: Mon, 19 Apr 2010 11:42:53 +0200


This is to let you know that Hydra build 353184 of job 
gnu:guile-master:build_disable_deprecated_disable_discouraged has changed from 

Complete build information can be found on this page:

The last 50 lines of the build log are shown at the bottom of this email.

A summary of the build information follows:

Build ID:              | 353184
Nix name:              | guile-disable-deprecated-disable-discouraged-
Short description:     | Native Nix build on x86_64-linux
Maintainer(s):         | address@hidden
System:                | x86_64-linux
Derivation store path: | 
Output store path:     | 
Time added:            | 2010-04-19 11:42:53
Build started:         | 2010-04-19 11:27:30
Build finished:        | 2010-04-19 11:42:53
Duration:              | 923s

The build inputs were:

Name        | Type  | Value
hydraConfig | svn   |
nixpkgs     | svn   |
tarball     | build | 353100


The Hydra build daemon.

Running statprof.test
UNRESOLVED: statprof.test: accurate call counting
Running strings.test
Running structs.test
Running sxml.fold.test
Running sxml.ssax.test
Running sxml.transform.test
Running sxml.xpath.test
Running symbols.test
Running syncase.test
Running syntax.test
UNRESOLVED: syntax.test: letrec: bindings: initial bindings are undefined
Running texinfo.docbook.test
Running texinfo.serialize.test
Running texinfo.string-utils.test
Running texinfo.test
Running threads.test
Running time.test
Running tree-il.test
UNRESOLVED: tree-il.test: warnings: unused-toplevel: used by macro
Running version.test
UNRESOLVED: version.test: version reporting works
Running vlist.test
Running weaks.test

Totals for this test run:
passes:                 12174
failures:               6
unexpected passes:      0
expected failures:      37
unresolved test cases:  1051
untested test cases:    1
unsupported test cases: 9
errors:                 0

FAIL: check-guile
1 of 1 test failed
Please report to address@hidden
make[2]: *** [check-TESTS] Error 1
make[2]: Leaving directory 
make[1]: *** [check-am] Error 2
make[1]: Leaving directory 
make: *** [check-recursive] Error 1
build time elapsed:  0m0.021s 0m0.007s 12m3.295s 0m49.276s
builder for 
 failed with exit code 2
error: build of 
Shared connection to kenny closed.

build of 
 on address@hidden' failed with exit code 256

reply via email to

[Prev in Thread] Current Thread [Next in Thread]