[Top][All Lists]

[Date Prev][Date Next][Thread Prev][Thread Next][Date Index][Thread Index]

[Guile-commits] Hydra job gnu:guile-master:build build 347340 FAILED

From: Hydra Build Daemon
Subject: [Guile-commits] Hydra job gnu:guile-master:build build 347340 FAILED
Date: Fri, 9 Apr 2010 22:55:49 +0200


This is to let you know that Hydra build 347340 of job gnu:guile-master:build 
has changed from SUCCEEDED to FAILED.

Complete build information can be found on this page:

The last 50 lines of the build log are shown at the bottom of this email.

A summary of the build information follows:

Build ID:              | 347340
Nix name:              | guile-
Short description:     | Native Nix build on i686-darwin
Maintainer(s):         | address@hidden
System:                | i686-darwin
Derivation store path: | 
Output store path:     | 
Time added:            | 2010-04-09 22:55:49
Build started:         | 2010-04-09 22:55:46
Build finished:        | 2010-04-09 22:55:49
Duration:              | 3s

The build inputs were:

Name        | Type   | Value
hydraConfig | svn    |
nixpkgs     | svn    |
system      | string | i686-darwin
tarball     | build  | 347276


The Hydra build daemon.

building `/nix/store/63ychs9jlbjlg1yl7h262q6sjzhil8va-guile-' on 
copying inputs...
copying these missing paths:
error: creating directory `/nix/store/nix-82369-0': No space left on device
error: writing to file: Broken pipe
copying store paths to remote machine address@hidden' failed: 256 at 
 line 91.
cannot copy inputs to address@hidden: 256 at 
 line 209, <STDIN> line 1.

reply via email to

[Prev in Thread] Current Thread [Next in Thread]