[Top][All Lists]

[Date Prev][Date Next][Thread Prev][Thread Next][Date Index][Thread Index]

Error during compilation

From: Gregory Casamento
Subject: Error during compilation
Date: Wed, 11 Oct 2000 20:06:24 -0700 (PDT)

During compilation I received the following error:

mkdir -p example.service/Resources
/bin/sh: opentool: command not found
make[4]: *** [example.service/Resources/Info-gnustep.plist] Error 1
make[3]: *** [example.build] Error 2
make[2]: *** [example.all.svc.variables] Error 2
make[2]: Leaving directory `/home/heron/gstep-001011/gui/Tools'
make[1]: *** [internal-all] Error 2
make[1]: Leaving directory `/home/heron/gstep-001011/gui'
make: *** [subproj-all] Error 2

Has openapp become a prerequisite for installing GNUstep?   The install process
should be as easy as:

1) ./configure
2) make
3) make install

I am doing an update from CVS to see if there is still an issue.

Thanks, GJC

Gregory John Casamento           Sr. Software Engineer
Software patents are endangering the computer industry
in the US and around the world.  Join the LPF and help 
the cause.       http://lpf.ai.mit.edu/

Do You Yahoo!?
Get Yahoo! Mail - Free email you can access from anywhere!

reply via email to

[Prev in Thread] Current Thread [Next in Thread]