bug-cvs
[Top][All Lists]
Advanced

[Date Prev][Date Next][Thread Prev][Thread Next][Date Index][Thread Index]

Problem compileing cvs-1.11.5 on OpenServer 5.0.X ...S_ISSOCK


From: Boyd Lynn Gerber
Subject: Problem compileing cvs-1.11.5 on OpenServer 5.0.X ...S_ISSOCK
Date: Thu, 8 May 2003 17:21:41 -0600 (MDT)

I am currently running version 1.11.  I am unable to compile cvs-1.11.5
with gcc-2.95.3 on OpenServer 5.0.6a.  I have the same problem with .5x
.6x and .7  I do not have any older version running currently to try.
Below is the results of make.


make  all-recursive
make[1]: Entering directory `/usr/zenez/build/osr5/cvs-1.11.5'
Making all in lib
make[2]: Entering directory `/usr/zenez/build/osr5/cvs-1.11.5/lib'
make[2]: Nothing to be done for `all'.
make[2]: Leaving directory `/usr/zenez/build/osr5/cvs-1.11.5/lib'
Making all in zlib
make[2]: Entering directory `/usr/zenez/build/osr5/cvs-1.11.5/zlib'
make[2]: Nothing to be done for `all'.
make[2]: Leaving directory `/usr/zenez/build/osr5/cvs-1.11.5/zlib'
Making all in diff
make[2]: Entering directory `/usr/zenez/build/osr5/cvs-1.11.5/diff'
make[2]: Nothing to be done for `all'.
make[2]: Leaving directory `/usr/zenez/build/osr5/cvs-1.11.5/diff'
Making all in src
make[2]: Entering directory `/usr/zenez/build/osr5/cvs-1.11.5/src'
gcc  -g -O2   -o cvs  add.o admin.o annotate.o buffer.o checkin.o checkout.o 
classify.o client.o commit.o create_adm.o cvsrc.o diff.o edit.o entries.o 
error.o expand_path.o fileattr.o filesubr.o find_names.o hardlink.o hash.o 
history.o ignore.o import.o lock.o log.o login.o logmsg.o main.o mkmodules.o 
modules.o myndbm.o no_diff.o parseinfo.o patch.o rcs.o rcscmds.o recurse.o 
release.o remove.o repos.o root.o run.o scramble.o server.o status.o subr.o 
tag.o update.o version.o vers_ts.o watch.o wrapper.o zlib.o ../diff/libdiff.a 
../lib/libcvs.a ../zlib/libz.a -lsocket -lnsl
Undefined                       first referenced
 symbol                             in file
S_ISSOCK                            buffer.o
cvs: fatal error: Symbol referencing errors. No output written to cvs
collect2: ld returned 1 exit status
make[2]: *** [cvs] Error 1
make[2]: Leaving directory `/usr/zenez/build/osr5/cvs-1.11.5/src'
make[1]: *** [all-recursive] Error 1
make[1]: Leaving directory `/usr/zenez/build/osr5/cvs-1.11.5'
make: *** [all] Error 2

Thanks,

--
Boyd Gerber <address@hidden>
ZENEZ   1042 East Fort Union #135, Midvale Utah  84047








reply via email to

[Prev in Thread] Current Thread [Next in Thread]